periscope ontology.owl
type: Ontology
comment: Ontology that models and integrates knowledge about the policies and constraints during the pandemic, the agency implementing them, the geographic areas affected, the people affected, and the political, socio-economic and health impact measures of those policy measures.
version info: 1.3.1

ISO2
type: Datatype
equivalent class: Datatype
  on datatype: string
  with restrictions:
    pattern: [A-Z]{2}

ISO3
type: Datatype
equivalent class: Datatype
  on datatype: string
  with restrictions:
    pattern: [A-Z]{3}

ISOL2
type: Datatype
equivalent class: Datatype
  on datatype: string
  with restrictions:
    pattern: [A-Z]{2}[\-][\w]{2,3}

geographic level
type: Datatype
equivalent class: Datatype
  one of: city
  one of: continent
  one of: country
  one of: municipality
  one of: other
  one of: province
  one of: region

percentage
type: Datatype
equivalent class: Datatype
  on datatype: double
  with restrictions:
    min inclusive: 0.0
  with restrictions:
    max inclusive: 100.0

sources
type: Datatype
equivalent class: Datatype
  one of: Coronanet
  one of: ECDC
  one of: OECD
  one of: Policy intensity scores

target direction
type: Datatype
equivalent class: Datatype
  one of: Inbound
  one of: Inbound/Outbound
  one of: Outbound
type: DatatypeProperty
domain: Policy decision

vaccine type
type: Datatype
equivalent class: Datatype
  one of: antigenic
  one of: inactivated
  one of: mRNA
  one of: recombinant
  one of: viral vector
type: DatatypeProperty
domain: Vaccines

acts in
type: ObjectProperty
inverse of: is subject to
domain: Policy decision
range: Type of place
comment: Relation between a policy decision and type of place

affect to
type: ObjectProperty
inverse of: who is affected
domain: Impact metrics
range: Demographic target

are related to
type: ObjectProperty
inverse of: related to
domain: Services
range: Impact metrics

belongs to
type: ObjectProperty
inverse of: contains a
type: IrreflexiveProperty
domain: Geographic target
range: Geographic target

conditions
type: ObjectProperty
inverse of: is conditioned by
domain: Policy decision
range: Geographic target

contains a
type: ObjectProperty
type: IrreflexiveProperty
domain: Geographic target
range: Geographic target

controls
type: ObjectProperty
inverse of: is controlled by a
domain: Policy decision
range: Services

currency from
type: ObjectProperty
domain: currency
range: Geographic target

define
type: ObjectProperty
inverse of: is defined by
domain: Impact metrics
range: Geographic target

has metric
type: ObjectProperty
inverse of: referred to
domain: Policy decision
range: Impact metrics

has mobility
type: ObjectProperty
sub property of: topObjectProperty
inverse of: mobility of a
domain: Type of place
range: mobility

have workers
type: ObjectProperty
inverse of: who works in
domain: Type of place
range: Demographic target

influences
type: ObjectProperty
inverse of: is influenced by
domain: Policy decision
range: Demographic target

is conditioned by
type: ObjectProperty
type: FunctionalProperty
domain: Geographic target
range: Policy decision

is controlled by a
type: ObjectProperty
domain: Services
range: Policy decision

is defined by
type: ObjectProperty
domain: Geographic target
range: Impact metrics

is from
type: ObjectProperty
type: FunctionalProperty
domain: Enforcer
range: Geographic target

is given to a
type: ObjectProperty
inverse of: who receive a
domain: Services
range: Demographic target

is in a
type: ObjectProperty
inverse of: of
domain: Type of vehicle
range: Transport station

is influenced by
type: ObjectProperty
domain: Demographic target
range: Policy decision

is made by
type: ObjectProperty
inverse of: makes
domain: Policy decision
range: Enforcer

is subject to
type: ObjectProperty
domain: Type of place
range: Policy decision

is updated
type: ObjectProperty
inverse of: update
type: IrreflexiveProperty
domain: Policy decision
range: Policy decision

living in
type: ObjectProperty
inverse of: where live the
domain: Demographic target
range: Geographic target

makes
type: ObjectProperty
domain: Enforcer
range: Policy decision

mobility of a
type: ObjectProperty
domain: mobility
range: Type of place

of
type: ObjectProperty
domain: Transport station
range: Type of vehicle

offered by a
type: ObjectProperty
inverse of: provides
domain: Services
range: Type of place

provides
type: ObjectProperty
domain: Type of place
range: Services

referred to
type: ObjectProperty
domain: Impact metrics
range: Policy decision

related to
type: ObjectProperty
domain: Impact metrics
range: Services

update
type: ObjectProperty
type: IrreflexiveProperty
domain: Policy decision
range: Policy decision

where live the
type: ObjectProperty
domain: Geographic target
range: Demographic target

who is affected
type: ObjectProperty
domain: Demographic target
range: Impact metrics

who receive a
type: ObjectProperty
domain: Demographic target
range: Services

who works in
type: ObjectProperty
domain: Demographic target
range: Type of place

ISO A2
type: DatatypeProperty
domain: Geographic target
range: ISO2
comment: 2-digit ISO country codes

ISO A3
type: DatatypeProperty
domain: Geographic target
range: ISO3
comment: 3-digit ISO country codes

ISO L2
type: DatatypeProperty
domain: Geographic target
range: ISOL2
comment: digit ISO code that defines a region area

date
type: DatatypeProperty
domain: Class
  union of: Impact metrics
  union of: Policy decision
range: dateTime
comment: Defines the dates on which something happens

date announced
type: DatatypeProperty
sub property of: date
domain: Policy decision
range: dateTime
comment: When the policy is announced

date end
type: DatatypeProperty
sub property of: date
domain: Policy decision
range: dateTime
comment: When the policy ends (if it has an explicit end date)

date start
type: DatatypeProperty
sub property of: date
domain: Policy decision
range: dateTime
comment: When the policy goes into effect

date updated
type: DatatypeProperty
sub property of: date
domain: Policy decision
range: dateTime
comment: When we can confirm the country - policy type was last checked/updated (we can only confirm policy type for a given country is up to date as of this date)

domestic policy
type: DatatypeProperty
domain: Policy decision
range: boolean
comment: Marks whether the initiator of a policy is the same as the target of the policy (1) or not (0).

description
type: DatatypeProperty
domain: Policy decision
range: string
comment: A short description of the policy

geographical Level
type: DatatypeProperty
domain: Class
  union of: Geographic target
  union of: Political
range: geographic level
comment: Which geographical or administrative entity is affected Types : { "city" , "continent " , "country" , "municipality" , "other" , "province" , "region"}

init country level
type: DatatypeProperty
domain: Policy decision
range: geographic level
comment: Whether the policy came from the national level or a sub-national unit

link
type: DatatypeProperty
domain: Policy decision
range: string
comment: A link to at least one source for the policy

maximum
type: DatatypeProperty
sub property of: number of
domain: Class
  union of: Fines
  union of: Age
range: int

minimum
type: DatatypeProperty
sub property of: number of
domain: Class
  union of: Fines
  union of: Age
range: int

number of
type: DatatypeProperty
sub property of: topDataProperty
domain: Class
  union of: Gatherings
  union of: Services
  union of: Social distancing
  union of: limit social contact
range: int
comment: quantity defined by a number

percent
type: DatatypeProperty
domain: Gatherings
range: percentage

policy id
type: DatatypeProperty
domain: Policy decision
range: string
comment: Identifier linking new policies with subsequent updates to policies An ID which links policies over time, where the beginning of policy is noted as a ‘New Entry’ and follow-ons to a policy are noted as an ‘Update’ (see entry type). Policies can be updated as long as the following information remains constant: policy initiator, policy type, policy sub type, geographic target, demographic target. E.g. a policy which is extended over time would count as an update, but a policy that changes its demographic target would count as a new policy. This id is generated randomly in Qualtrics.

record id
type: DatatypeProperty
domain: Policy decision
range: string
comment: Unique identifier for each unique policy record

institution status
type: DatatypeProperty
sub property of: description
domain: Policy decision
range: string

name
type: DatatypeProperty
domain: Class
  union of: Geographic target
  union of: Profession
range: string
comment: Property that defines the name of something

Delivery
type: Class
subclass of: Distribution

Health questionnaire
type: Class
subclass of: Health measures

Policy intensity scores
type: Class
subclass of: Impact metrics

Takeaway
type: Class
subclass of: Distribution

Coronavirus infectious disease
type: Class
subclass of: DOID 934
IAO_0000115: A viral infectious disease that has_material_basis_in Coronavirus.
has OBO namespace: disease_ontology
id: DOID:0080599

Axiom
annotated source: Coronavirus infectious disease
annotated property: IAO_0000115
annotated target: A viral infectious disease that has_material_basis_in Coronavirus.
has db xref: url:https://www.cdc.gov/coronavirus/
has db xref: url:https://www.ncbi.nlm.nih.gov/books/NBK7782/
has db xref: url:https://www.who.int/health-topics/coronavirus

ASEAN countries
type: Class
subclass of: Political distribution

Accomodation places
type: Class
subclass of: Business
comment: These are establishments that provide services for the rental or purchase of accommodation

Active infection test
type: Class
subclass of: Tests
comment: Active infection test. Depends on its frequency (daily, weekly, fortnightly, monthly...) and the type of numerical value it refers to (level, ratio or index, rate, average, growth in the same period of the previous year, growth previous period, cumulative count...)

Adaptation of workplaces
type: Class
subclass of: Work
comment: Policies related to the adaptation of workplaces to comply with health standards in relation to the virus

Administering
type: Class
subclass of: Distribution
comment: The administrative service is a supporting unit whose main aim is to control the financial and economic aspects of the scheme for the manager of the organization.

Administrative configurations
type: Class
subclass of: Distribution of competences
comment: Administrative configurations has a change or include new content

Adults
type: Class
subclass of: Age
comment: A person having attained full growth or maturity. Adults are of 19 through 44 years of age. For a person between 19 and 24 years of age, YOUNG ADULT is available. [MESH]

Aerial
type: Class
subclass of: Type of vehicle
comment: Type of air transport

Africa
type: Class
subclass of: Geographical distribution

Agriculture
type: Class
subclass of: growing - harvesting of organic commodities
comment: The science, art or practice of cultivating soil, producing crops, and raising livestock. [MESH]

Allowed
type: Class
subclass of: Type restriction
comment: Referring to policy measures related to the permitting of activities, services...

american indian
type: Class
subclass of: Race
comment: american indian or alaska native: A person having origins in any of the original peoples of North and South America (including Central America), and who maintains tribal affiliation or community attachment

Animal traction
type: Class
subclass of: Type of vehicle

Anti-Disinformation
type: Class
subclass of: Public Awareness Measures
comment: Policies of Public Awareness Measures related to anti-disinformation

Antibody tests
type: Class
subclass of: Tests
comment: Antibody tests. Depends on its frequency (daily, weekly, fortnightly, monthly...) and the type of numerical value it refers to (level, ratio or index, rate, average, growth in the same period of the previous year, growth previous period, cumulative count...)

Apartment
type: Class
subclass of: Accomodation places

Apps
type: Class
subclass of: Engagement
comment: Policies of Public Awareness Measures related to engagement through apps

Aquatic
type: Class
subclass of: Type of vehicle
comment: Aquatic/maritime transports

Army
type: Class
subclass of: Health Staff
comment: Army (medical corps) Military personnel who may support or provide medical treatment and services

Asia
type: Class
subclass of: Geographical distribution

Audience
type: Class
subclass of: Task
comment: The assembled spectators or listeners at a public event such as a play, film, concert, meeting...

Bar
type: Class
subclass of: Business
comment: This refers to establishments that primarily provide alcoholic drink services to patrons

Beach
type: Class
subclass of: Civic structure
comment: A landform consisting of loose rock particles such as sand, gravel, shingle, pebbles, cobble, or even shell fragments along the shoreline of a body of water. [ENVO]

Broad money
type: Class
subclass of: Price-purchasing power indicators
comment: Broad money (M3) includes currency, deposits with an agreed maturity of up to two years, deposits redeemable at notice of up to three months and repurchase agreements, money market fund shares/units and debt securities up to two years. M3 is measured as a seasonally adjusted index based on 2015=100. Depends on its frequency (daily, weekly, fortnightly, monthly...) and the type of numerical value it refers to (level, ratio or index, rate, average, growth in the same period of the previous year, growth previous period, cumulative count...)

Buses
type: Class
subclass of: Terrestrial
comment: Buses as a means of transportation

Business
type: Class
subclass of: Type of place
comment: Bussiness related to insurance, reinsurance and pension funding

COVID-19
type: Class
subclass of: direct
comment: Health metrics directly with the COVID19. Depends on its frequency (daily, weekly, fortnightly, monthly...) and the type of numerical value it refers to (level, ratio or index, rate, average, growth in the same period of the previous year, growth previous period, cumulative count...)

COVID-19 Vaccines
type: Class
subclass of: Vaccines
comment: This variable documents the intended policy goal with regards to COVID-19 vaccines

Calls
type: Class
subclass of: Engagement
comment: Policies of Public Awareness Measures related to engagement through calls

Campground
type: Class
subclass of: Civic structure
comment: A part of an ecosystem which may be or has been used for one or more overnight stays by humans sheltering in tents, camper vans, caravans, or improvised shelters. [ENVO]

Camping
type: Class
subclass of: Accomodation places

Cancellation
type: Class
subclass of: Type restriction
comment: Policy measures related to the cancellation of activities or suspension of services

Cars
type: Class
subclass of: Terrestrial

cases
type: Class
subclass of: COVID-19
comment: Define the number of COVID19 cases (active+deaths+recovered). Depends on its frequency (daily, weekly, fortnightly, monthly...) and the type of numerical value it refers to (level, ratio or index, rate, average, growth in the same period of the previous year, growth previous period, cumulative count...)

Cementery
type: Class
subclass of: Civic structure
comment: A cemetery, burial ground, gravesite or graveyard is a place where the remains of dead people are buried or otherwise interred. The word cemetery implies that the land is specifically designated as a burial ground and originally applied to the Roman catacombs.

Central america
type: Class
subclass of: Geographical distribution

Certain health conditions
type: Class
subclass of: Population special conditions
comment: Population special conditions: People with certain health conditions

Change
type: Class
subclass of: Update
comment: A dimension other than the policy initiator, policy type, policy sub type, geographic target, demographic target has changed

Children
type: Class
subclass of: Age
comment: Demographic target who by age belong to the category of children A person 6 to 12 years of age. An individual 2 to 5 years old is CHILD, PRESCHOOL. [MESH]

Citizen Residents
type: Class
subclass of: Origin
comment: Government policies that apply only to citizens who are residing in the country initiating the policy.

Citizen Travelers
type: Class
subclass of: Origin
comment: A government policy that applies only to domestic na tionals travelling outside the country initiating the policy.

Civic structure
type: Class
subclass of: Type of place

Clinic
type: Class
subclass of: General health
comment: A health care facility where patients are admitted to get treatment provided by a group of physicians practicing medicine together. [NCIT]

Clousure
type: Class
subclass of: Type restriction
comment: Policy measure related to the closure of places (bussiness, civic structures...)

Clousures of workplaces
type: Class
subclass of: Work
comment: Policies related to the closure of workplaces

Commercial businesses
type: Class
subclass of: Business
comment: These refer to establishments that provide recreational services

Commercial transactions
type: Class
subclass of: Socio-economic
comment: Depends on its frequency (daily, weekly, fortnightly, monthly...) and the type of numerical value it refers to (level, ratio or index, rate, average, growth in the same period of the previous year, growth previous period, cumulative count...)

Compliance
type: Class
subclass of: Policy decision
comment: This variable captures information about the de jure compliance of a policy

Conditions
type: Class
subclass of: Allowed
comment: Measures related to permission but conditional on services, activities...

Construction
type: Class
subclass of: Business
comment: Construction Business means the general contracting, construction management, engineering and design build services business of Borrower and its Subsidiaries or any business substantially related or incidental thereto.

Consumer prices
type: Class
subclass of: Price-purchasing power indicators
comment: Inflation measured by consumer price index (CPI) is defined as the change in the prices of a basket of goods and services that are typically purchased by specific groups of households. Inflation is measured in terms of the annual growth rate and in index, 2015 base year with a breakdown for food, energy and total excluding food and energy. Inflation measures the erosion of living standards. A consumer price index is estimated as a series of summary measures of the period-to-period proportional change in the prices of a fixed set of consumer goods and services of constant quantity and characteristics, acquired, used or paid for by the reference population. Each summary measure is constructed as a weighted average of a large number of elementary aggregate indices. Each of the elementary aggregate indices is estimated using a sample of prices for a defined set of goods and services obtained in, or by residents of, a specific region from a given set of outlets or other sources of consumption goods and services. Depends on its frequency (daily, weekly, fortnightly, monthly...) and the type of numerical value it refers to (level, ratio or index, rate, average, growth in the same period of the previous year, growth previous period, cumulative count...)

Containment
type: Class
subclass of: Policy decision
subclass of: Restriction
  on property: acts in
  all values from: Type of place
comment: Closure - containment

Content
type: Class
subclass of: Public Awareness Measures
comment: Policies of Public Awareness Measures related to content

Correct type
type: Class
subclass of: Entry type
comment: Information as to whether a given record has been corrected or not

Correction
type: Class
subclass of: Correct type
comment: The original entry has been corrected

Courts
type: Class
subclass of: Civic structure
comment: A court is any person or institution, often as a government institution, with the authority to adjudicate legal disputes between parties and carry out the administration of justice in civil, criminal, and administrative matters in accordance with the rule of law.

Covid Testing Facility
type: Class
subclass of: General health
comment: Covid sanitary testing facilities

Cruises
type: Class
subclass of: Aquatic
comment: Cruise ships are large passenger ships used mainly for vacationing. Unlike ocean liners, which are used for transport, cruise ships typically embark on round-trip voyages to various ports-of-call, where passengers may go on tours known as "shore excursions".

Cultural related
type: Class
subclass of: Commercial businesses
comment: Cultural related site refers to any facility for the performing arts, exhibits, or concerts that is open to all age groups. For example, museum, gallery, theatrer music or zoo.

Curfew
type: Class
subclass of: Restriction
comment: Government policies that limit domestic freedom of movement to certain times of the day.

Current account
type: Class
subclass of: Economic growth indicator
comment: Balance of Payments (BOP6) : Current account balance as a % of GDP is a statistical statement that provides a systematic summary of economic transactions of an economy with the rest of the world, for a specific time period. The transactions are for the most part between residents and non-residents of the economy. A transaction is defined as an economic flow that reflects the creation, transformation, exchange, transfer, or extinction of economic value and involves changes in ownership, of goods or assets, the provision of services, labour or capital. This dataset presents economies compiling balance of payments statistics in accordance with the 6th edition of the Balance of Payments and International Investment Position Manual published by the IMF (BPM6). Transactions include: the goods and services accounts, the primary income account (income account in BPM5), the secondary income account (transfers in BPM5), the capital account, and the financial account.Depends on its frequency (daily, weekly, fortnightly, monthly...) and the type of numerical value it refers to (level, ratio or index, rate, average, growth in the same period of the previous year, growth previous period, cumulative count...)

deaths
type: Class
subclass of: cases
comment: The number of COVID-19 deceased patients. Depends on its frequency (daily, weekly, fortnightly, monthly...) and the type of numerical value it refers to (level, ratio or index, rate, average, growth in the same period of the previous year, growth previous period, cumulative count...)

Declaration of Emergency
type: Class
subclass of: Containment
comment: The head of government declares a state of national emergency.

Demographic target
type: Class
subclass of: Restriction
  on property: is influenced by
  all values from: Policy decision
subclass of: Restriction
  on property: living in
  all values from: Demographic target
subclass of: Restriction
  on property: who is affected
  all values from: Impact metrics
subclass of: Restriction
  on property: who receive a
  all values from: Services
subclass of: Restriction
  on property: who works in
  all values from: Type of place
comment: Define who the policy is targeted at. This variable codes the people or materials who are the target of a particular policy

Dentist
type: Class
subclass of: Medical

Development
type: Class
subclass of: Services
comment: Development service

Different institution
type: Class
subclass of: Enforcer
comment: Another institution not mencioned who can make decisions

Disseminating
type: Class
subclass of: Public Awareness Measures
comment: Policies of Public Awareness Measures related to disseminating

Distribution
type: Class
subclass of: Services
comment: Distribution service

Distribution of competences
type: Class
subclass of: Policy decision
comment: Distribution of competences (transfer competences to other existing entity, creation of new task force or changes in administrative configurations)

Doctors
type: Class
subclass of: Health Staff
comment: Accredited professionals with a license to provide medical treatment and services and are permitted to make medical decisions.

Domestic abusers
type: Class
subclass of: Population special conditions
comment: Population special conditions: Domestic abusers

Domestically abused people
type: Class
subclass of: Population special conditions
comment: Population special conditions:Domestically abused people

Economic growth indicator
type: Class
subclass of: Socio-economic
comment: Depends on its frequency (daily, weekly, fortnightly, monthly...) and the type of numerical value it refers to (level, ratio or index, rate, average, growth in the same period of the previous year, growth previous period, cumulative count...)

Economic measures
type: Class
subclass of: Policy decision
comment: Economic-related policy measures

Education center
type: Class
subclass of: Business
comment: Educational establishment Used for education, training programs, and courses in various fields and disciplines, and for training groups of persons. [MESH]

Elderly
type: Class
subclass of: Age
comment: An age group comprised of individuals 65 years of age and older. [NCIT]

Electricity, Gas, Steam, air conditioning
type: Class
subclass of: Business
comment: Bussiness related to electricity, gas, steam and air conditioning supply

Emergency investment
type: Class
subclass of: Health Resources

Employment
type: Class
subclass of: Labour market
comment: Employment rates are defined as a measure of the extent to which available labour resources (people available to work) are being used. They are calculated as the ratio of the employed to the working age population. Employment rates are sensitive to the economic cycle, but in the longer term they are significantly affected by governments' higher education and income support policies and by policies that facilitate employment of women and disadvantaged groups. Employed people are those aged 15 or over who report that they have worked in gainful employment for at least one hour in the previous week or who had a job but were absent from work during the reference week. The working age population refers to people aged 15 to 64. This indicator is seasonally adjusted and it is measured in terms of thousand persons aged 15 and over; and in numbers of employed persons aged 15 to 64 as a percentage of working age population. Depends on its frequency (daily, weekly, fortnightly, monthly...) and the type of numerical value it refers to (level, ratio or index, rate, average, growth in the same period of the previous year, growth previous period, cumulative count...)

Enforcer
type: Class
subclass of: Restriction
  on property: is from
  all values from: Geographic target
subclass of: Restriction
  on property: makes
  all values from: Policy decision
subclass of: Restriction
  on property: geographical Level
  all values from: geographic level
comment: Defines which unit/entity in the country is responsible for enforcement/implementing of the policy

Engagement
type: Class
subclass of: Public Awareness Measures
comment: Policies of Public Awareness Measures related to engagement

Entertainment venues
type: Class
subclass of: Civic structure
comment: A venue which provides some form or multiple forms of entertainment. [GSSO]

Entry type
type: Class
subclass of: Policy decision
comment: Information as to where in the policy history of a given policy a record is situated

Essential
type: Class
subclass of: Relevance

Essential worker
type: Class
subclass of: Worker
comment: Essential workers are those who conduct a range of operations and services that are typically essential to continue critical infrastructure operations

Europe
type: Class
subclass of: Geographical distribution

European union
type: Class
subclass of: Political distribution

European union and UK
type: Class
subclass of: Political distribution

Exceptions
type: Class
subclass of: Mandatory
comment: There are some exceptions to the policy but it is mandatory for those for whom it applies

Exchange rates
type: Class
subclass of: Price-purchasing power indicators
comment: Exchange rates are defined as the price of one country's' currency in relation to another country's currency. This indicator is measured in terms of national currency per US dollar. Depends on its frequency (daily, weekly, fortnightly, monthly...) and the type of numerical value it refers to (level, ratio or index, rate, average, growth in the same period of the previous year, growth previous period, cumulative count...)

Existing entity
type: Class
subclass of: Distribution of competences
comment: Existing gobernment entity given new powers

Exports in goods
type: Class
subclass of: Commercial transactions
comment: Trade in goods includes all goods which add to, or subtract from, the stock of material resources of a country by entering its economic territory (imports) or leaving it (exports). This indicator is measured in million USD. Goods are physical, produced items over which ownership rights can be established and whose economic ownership can be passed from one institutional unit to another by engaging in transactions. Goods being transported through a country or temporarily admitted or withdrawn (except for goods for inward or outward processing) are not included. All OECD countries compile their data according to the 2008 System of National Accounts (SNA). Depends on its frequency (daily, weekly, fortnightly, monthly...) and the type of numerical value it refers to (level, ratio or index, rate, average, growth in the same period of the previous year, growth previous period, cumulative count...)

External border
type: Class
subclass of: Restriction
comment: Government policies which reduce the ability to access ports of exit to or from different governmental jurisdictions.

Female
type: Class
subclass of: Sex
comment: Population whose sex is female

Ferries
type: Class
subclass of: Rail
comment: Ferries as a means of transportation

Final
type: Class
subclass of: Update
comment: Either the policy has been cancelled/terminated or one of the following dimensions has changed: the policy initiator, policy type, policy sub type, geographic target, demographic target.

Financial
type: Class
subclass of: Business
comment: Services that provide money management assistance. [APAONTO]

Inclusion
type: Class
subclass of: Social

Fines
type: Class
subclass of: Mandatory
subclass of: Restriction
  on property: maximum
  all values from: int
subclass of: Restriction
  on property: minimum
  all values from: int
comment: The prescribed government policy is mandatory/ must be followed but some exceptions are allowed. If the policy is not followed, people must pay a fine

Fiscal-monetary
type: Class
subclass of: Economic measures
comment: Fiscal/monetary

Fishing
type: Class
subclass of: growing - harvesting of organic commodities
comment: Bussiness related to fishing

Foreign Residents
type: Class
subclass of: Origin
comment: Government policies that that apply only to foreign na tionals who are residing in the country in initiating the policy

Foreign Travelers
type: Class
subclass of: Origin
comment: A government policy that applies to only to foreign nationals travelling outside the country initiating the policy

Forestry
type: Class
subclass of: growing - harvesting of organic commodities
comment: Bussiness related to forestry

Fundamental rights
type: Class
subclass of: Restriction
comment: Policies that conflict with or restrict the fundamental rights of individuals

GDP
type: Class
subclass of: Economic growth indicator
comment: Gross domestic product (GDP) is the standard measure of the value added created through the production of goods and services in a country during a certain period. As such, it also measures the income earned from that production, or the total amount spent on final goods and services (less imports). While GDP is the single most important indicator to capture economic activity, it falls short of providing a suitable measure of people's material well-being for which alternative indicators may be more appropriate. This indicator is based on nominal GDP (also called GDP at current prices or GDP in value) and is available in different measures: US dollars and US dollars per capita (current PPPs). All OECD countries compile their data according to the 2008 System of National Accounts (SNA). This indicator is less suited for comparisons over time, as developments are not only caused by real growth, but also by changes in prices and PPPs.Depends on its frequency (daily, weekly, fortnightly, monthly...) and the type of numerical value it refers to (level, ratio or index, rate, average, growth in the same period of the previous year, growth previous period, cumulative count...)

GDP Exports
type: Class
subclass of: Economic growth indicator
comment: Exports of goods and services as percent of GDP. Depends on its frequency (daily, weekly, fortnightly, monthly...) and the type of numerical value it refers to (level, ratio or index, rate, average, growth in the same period of the previous year, growth previous period, cumulative count...)

GDP Government consumption expenditure
type: Class
subclass of: Economic growth indicator
comment: General government spending provides an indication of the size of government across countries. The large variation in this indicator highlights the variety of countries' approaches to delivering public goods and services and providing social protection, not necessarily differences in resources spent. This indicator is measured in terms of thousand USD per capita, and as percentage of GDP. All OECD countries compile their data according to the 2008 System of National Accounts (SNA). Depends on its frequency (daily, weekly, fortnightly, monthly...) and the type of numerical value it refers to (level, ratio or index, rate, average, growth in the same period of the previous year, growth previous period, cumulative count...)

GDP Gross fixed capital formation
type: Class
subclass of: Economic growth indicator
comment: Gross fixed capital formation (GFCF), also called "investment", is defined as the acquisition of produced assets (including purchases of second-hand assets), including the production of such assets by producers for their own use, minus disposals. The relevant assets relate to assets that are intended for use in the production of other goods and services for a period of more than a year. The term "produced assets" means that only those assets that come into existence as a result of a production process are included. It therefore does not include, for example, the purchase of land and natural resources. This indicator is available in different measures: GFCF at current prices and current PPPs in US dollars, and annual growth rates of GFCF at constant prices, as well as quarterly data for percentage change over previous period and percentage change over same period last year. All OECD countries compile their data according to the 2008 System of National Accounts (SNA). The indicator at current prices and current PPPs is less suited for comparisons over time, as developments are not only caused by real growth, but also by changes in prices and PPPs.. Depends on its frequency (daily, weekly, fortnightly, monthly...) and the type of numerical value it refers to (level, ratio or index, rate, average, growth in the same period of the previous year, growth previous period, cumulative count...)

GDP Imports
type: Class
subclass of: Economic growth indicator
comment: Imports of goods and services (% of GDP) Imports of goods and services represent the value of all goods and other market services received from the rest of the world. They include the value of merchandise, freight, insurance, transport, travel, royalties, license fees, and other services, such as communication, construction, financial, information, business, personal, and government services. They exclude compensation of employees and investment income (formerly called factor services) and transfer payments. Depends on its frequency (daily, weekly, fortnightly, monthly...) and the type of numerical value it refers to (level, ratio or index, rate, average, growth in the same period of the previous year, growth previous period, cumulative count...)

GDP Private final consumption expenditure
type: Class
subclass of: Economic growth indicator
comment: The Private final consumption expenditure (PFCE) is defined as the expenditure incurred by the resident households and non-profit institutions serving households (NPISH) on final consumption of goods and services, whether made within or outside the economic territory. Depends on its frequency (daily, weekly, fortnightly, monthly...) and the type of numerical value it refers to (level, ratio or index, rate, average, growth in the same period of the previous year, growth previous period, cumulative count...)

Gathering information
type: Class
subclass of: Public Awareness Measures
comment: Policies of Public Awareness Measures related to Gathering information

Gatherings
type: Class
subclass of: Restriction
subclass of: Restriction
  on property: number of
  all values from: int
subclass of: Restriction
  on property: percent
  all values from: percentage
comment: Government policies that limit the number of people allowed to congregate in a place.

General health
type: Class
subclass of: Medical
comment: These refer to establishments through which doctors/nurses provide medical care

Geographic target
type: Class
subclass of: Restriction
  on property: is conditioned by
  all values from: Policy decision
subclass of: Restriction
  on property: is defined by
  all values from: Impact metrics
subclass of: Restriction
  on property: where live the
  all values from: Demographic target
subclass of: Restriction
  on property: belongs to
  max qualified cardinality: 1
  on class: Geographic target
subclass of: Restriction
  on property: contains a
  max qualified cardinality: 1
  on class: Geographic target
subclass of: Restriction
  on property: name
  all values from: string
subclass of: Restriction
  on property: ISO A2
  qualified cardinality: 1
  on data range: ISO2
subclass of: Restriction
  on property: ISO A3
  qualified cardinality: 1
  on data range: ISO3
subclass of: Restriction
  on property: geographical Level
  qualified cardinality: 1
  on data range: geographic level
subclass of: Restriction
  on property: ISO L2
  max qualified cardinality: 1
  on data range: ISO3
comment: This variable documents the geographic or administrative entity that the policy targets

Geographical distribution
type: Class
subclass of: Geographic target

Government
type: Class
subclass of: Enforcer
comment: This refers to the body that is responsible for national/provintial/state- level decision making.

Government building
type: Class
subclass of: Civic structure
comment: Government buildings and places where actions related to politics take place.

Governments locally elected
type: Class
subclass of: Political
comment: Metrics about governments locally elected

Hand sanitizer
type: Class
subclass of: Materials
comment: Preparations used as alternatives or supplements to hand washing with soap and water to destroy microorganisms and prevent transmission of pathogens. The active ingredient may be ETHANOL; 1-PROPANOL; or POVIDONE-IODINE in a gel, foam, or liquid solution. [MESH]

Health
type: Class
subclass of: Impact metrics
comment: Parameter that show the situation/impact about health of the geographic target

Health Certificates
type: Class
subclass of: External border
comment: Certifications given by a medical professional which verify that at the time of the certification, the traveler did not have COVID-19 or symptoms associated with COVID-19

Health Monitoring
type: Class
subclass of: Health measures
comment: Policy measures related to health monitoring

Health Resources
type: Class
subclass of: Health measures
subclass of: Restriction
  on property: acts in
  all values from: Type of place
comment: Government policies which affect the material (e.g. medical equipment, number of hospitals for public health) or human (e.g. doctors, nurses) health resources of a country.

Health Screenings
type: Class
subclass of: External border
comment: Health screenings done at ports of entry to ascertain the health of travelers in general

Health Staff
type: Class
subclass of: tertiary sector
comment: hr_target_staff. Takes a value of 1 if the target of a policy is health staff. [Coronanet codebook] Men and women working in the provision of health services, whether as individual practitioners or employees of health institutions and programs, whether or not professionally trained, and whether or not subject to public regulation. (From A Discursive Dictionary of Health Care, 1976) [Medical Subject Headings - Health Personnel]

Health Testing
type: Class
subclass of: Health measures
comment: Policies related to the performance of sanitary tests

Health center
type: Class
subclass of: General health
comment: Health center

Health measures
type: Class
subclass of: Policy decision
comment: Health-related policy measures

Higher education
type: Class
subclass of: Education center
comment: Takes a value of 1 if no restrictions are placed on higher education institutions (i.e. degree granting institutions), a value of 2 if these facilities are partly open, and a value of 3 if they are completely closed. [Coronanet Codebook]

Hiring
type: Class
subclass of: Economic measures
comment: Increase in hiring staff to address effects of COVID-19

Home
type: Class
subclass of: Civic structure
comment: A person's permanent place of residence. [NCIT]

Homeless population
type: Class
subclass of: Population special conditions
comment: Population special conditions:Homeless population

Hospitalization data
type: Class
subclass of: COVID-19
comment: The number of patients hospitalized in a certain moment, ICU or non-ICU and may be associated with a specific hospital process (admissions, discharges or transfers). Depends on its frequency (daily, weekly, fortnightly, monthly...) and the type of numerical value it refers to (level, ratio or index, rate, average, growth in the same period of the previous year, growth previous period, cumulative count...)

Hospitals
type: Class
subclass of: General health
comment: Institutions with an organized medical staff which provide medical care to patients. [MESH]

Hourly earnings
type: Class
subclass of: Price-purchasing power indicators
comment: The Hourly Earnings (MEI) dataset contains predominantly monthly statistics, and associated statistical methodological information, for the 35 OECD member countries and for selected non-member economies. The MEI Earnings dataset provides monthly and quarterly data on employees' earnings series. It includes earnings series in manufacturing and for the private economic sector. Mostly the sources of the data are business surveys covering different economic sectors, but in some cases administrative data are also used. The target series for hourly earnings correspond to seasonally adjusted average total earnings paid per employed person per hour, including overtime pay and regularly recurring cash supplements. Where hourly earnings series are not available, a series could refer to weekly or monthly earnings. In this case, a series for full-time or full-time equivalent employees is preferred to an all employees series.Depends on its frequency (daily, weekly, fortnightly, monthly...) and the type of numerical value it refers to (level, ratio or index, rate, average, growth in the same period of the previous year, growth previous period, cumulative count...)

Housing
type: Class
subclass of: Civic structure

Human teams
type: Class
subclass of: contact tracking
comment: Policy measures related to health monitoring through contact teams, human teams

Hygiene
type: Class
subclass of: Health measures
subclass of: Restriction
  on property: acts in
  all values from: Type of place
comment: Policy measures related to hygiene measures

ICU
type: Class
subclass of: occupancy hospital area installation
comment: Hospitalisation ICU. Depends on its frequency (daily, weekly, fortnightly, monthly...) and the type of numerical value it refers to (level, ratio or index, rate, average, growth in the same period of the previous year, growth previous period, cumulative count...) A health care facility unit that provides intensive care to critically ill patients and patients with complex medical problems who require constant monitoring or special therapy. [NCIT]

Imports in goods
type: Class
subclass of: Commercial transactions
comment: Trade in goods and services is defined as the transactions in goods and services between residents and non-residents. It is measured in million USD at 2015 constant prices and PPPs, as percentage of GDP for net trade, and also in annual growth for exports and imports. All OECD countries compile their data according to the 2008 System of National Accounts (SNA). Depends on its frequency (daily, weekly, fortnightly, monthly...) and the type of numerical value it refers to (level, ratio or index, rate, average, growth in the same period of the previous year, growth previous period, cumulative count...)

Industrial production
type: Class
subclass of: Socio-economic
comment: Industrial production refers to the output of industrial establishments and covers sectors such as mining, manufacturing, electricity, gas and steam and air-conditioning. This indicator is measured in an index based on a reference period that expresses change in the volume of production output.. Depends on its frequency (daily, weekly, fortnightly, monthly...) and the type of numerical value it refers to (level, ratio or index, rate, average, growth in the same period of the previous year, growth previous period, cumulative count...)

Information
type: Class
subclass of: Business
comment: It refers to businesses whose main activity is focused on the transmission and dissemination of information related to diferent topics.

Insurance
type: Class
subclass of: Health Resources
comment: Insurance providing coverage of medical, surgical, or hospital care in general or for which there is no specific heading. [MESH - Insurance, Health]

Insurance-reinsurance-pension funding
type: Class
subclass of: Business
comment: Bussiness related to agriculture Insurance- reinsurance-pension funding

Interbank
type: Class
subclass of: Price-purchasing power indicators
comment: Reference rate based on the interest rates at which banks offer unsecured funds to other banks in the wholesale money market or interbank market.. Interbank lending market. Depends on its frequency (daily, weekly, fortnightly, monthly...) and the type of numerical value it refers to (level, ratio or index, rate, average, growth in the same period of the previous year, growth previous period, cumulative count...)

Internal border
type: Class
subclass of: Restriction
comment: Government policies which reduce the ability to access ports of entry to or from different governmental jurisdictions.

Internet-Web
type: Class
subclass of: Engagement
comment: Policies of Public Awareness Measures related to engagement through

Intersex
type: Class
subclass of: Sex
comment: Population whose sex is intersex

Labour market
type: Class
subclass of: Socio-economic

Land border
type: Class
subclass of: Civic structure
comment: Land on the frontiers of two adjoining geographical areas

Latin america
type: Class
subclass of: Geographical distribution

Leading indicator
type: Class
subclass of: Economic growth indicator
comment: The composite leading indicator (CLI) is designed to provide early signals of turning points in business cycles showing fluctuation of the economic activity around its long term potential level. CLIs show short-term economic movements in qualitative rather than quantitative terms. Depends on its frequency (daily, weekly, fortnightly, monthly...) and the type of numerical value it refers to (level, ratio or index, rate, average, growth in the same period of the previous year, growth previous period, cumulative count...)

Legal penalties
type: Class
subclass of: Mandatory
comment: The prescribed government policy is mandatory/ must be followed. If the policy is not followed, people may face legal penalties like jail time

Library
type: Class
subclass of: Civic structure
comment: A curated collection of sources of information and similar resources, selected by experts and made accessible to a defined community for reference or borrowing. It provides physical or digital access to material, and may be a physical location or a virtual space, or both. [GSSO]

Lockdown
type: Class
subclass of: Restriction
comment: Targets of the policy are obliged shelter in place irrespective of potential likelihood of COVID-19 transmission and are only allowed to leave their shelter for specific reasons

Long-term interet rate
type: Class
subclass of: Price-purchasing power indicators
comment: Long-term interest rates refer to government bonds maturing in ten years. Rates are mainly determined by the price charged by the lender, the risk from the borrower and the fall in the capital value. Long-term interest rates are generally averages of daily rates, measured as a percentage. These interest rates are implied by the prices at which the government bonds are traded on financial markets, not the interest rates at which the loans were issued. In all cases, they refer to bonds whose capital repayment is guaranteed by governments. Long-term interest rates are one of the determinants of business investment. Low long-term interest rates encourage investment in new equipment and high interest rates discourage it. Investment is, in turn, a major source of economic growth. Depends on its frequency (daily, weekly, fortnightly, monthly...) and the type of numerical value it refers to (level, ratio or index, rate, average, growth in the same period of the previous year, growth previous period, cumulative count...)

Male
type: Class
subclass of: Sex
comment: Population whose sex is male

Management
type: Class
subclass of: Services
comment: Management
comment: Management service

Mandatory
type: Class
subclass of: Compliance
comment: The prescribed government policy is mandatory/must be followed but the penalty for failing to comply is not made explicit or is implied

Masks
type: Class
subclass of: Materials
comment: This refers to masks that cover the face which help filter out pollutants in the air

Materials
type: Class
subclass of: Health Resources
comment: Healthcare supplies: Disposable items used while providing care such as dressings, syringes, tubing, diapers, and baby bottles. (source : OMS) [ONTOAD]

Medical
type: Class
subclass of: Business
comment: Healthcare facility: Facility that is administered by a health care organization for the purpose of providing health care to a patient or patient population. [(IDO-COVID-19)]

Medicine
type: Class
subclass of: Materials
comment: Any substance which when absorbed into a living organism may modify one or more of its functions. The term is generally accepted for a substance taken for a therapeutic purpose, but is also commonly used for abused substances. [COVID-19 Ontology - FHG]

Meetings
type: Class
subclass of: Services
comment: Services related to meetings

Impact metrics
type: Class
subclass of: Restriction
  on property: affect to
  all values from: Demographic target
subclass of: Restriction
  on property: define
  all values from: Geographic target
subclass of: Restriction
  on property: related to
  all values from: Services
subclass of: Restriction
  on property: link
  some values from: string
subclass of: Restriction
  on property: number of
  some values from: int
subclass of: Restriction
  on property: source
  some values from: sources
subclass of: Restriction
  on property: date
  all values from: dateTime
subclass of: Restriction
  on property: date end
  all values from: dateTime
subclass of: Restriction
  on property: date start
  all values from: dateTime
comment: Defines multiple parameters that show the situation/impact of the geographic target

Middle east
type: Class
subclass of: Geographical distribution

Military
type: Class
subclass of: Enforcer
comment: This refers to the body that is responsible for security or defense at the national level

Mining - Quarrying
type: Class
subclass of: Business
comment: It refers to businesses whose main activity is focused on the extraction of minerals occurring naturally as solids (coal and ores), liquids (petroleum) or gases (natural gas). Extraction can be achieved by different methods such as underground or surface mining, well operation, seabed mining etc.

Ministry of Education
type: Class
subclass of: Enforcer
comment: Ministry/Department of Education:This refers to the body that is responsible for overseeing education outcomes at the national city or municipal level

Ministry of Foreign Affairs
type: Class
subclass of: Enforcer
comment: Ministry/Department of Foreign Affairs:This refers to the body that is responsible for overseeing the government relationships with foreign countries at the national level

Ministry of Health
type: Class
subclass of: Enforcer
comment: Ministry/Department of Health:This refers to the body that is responsible for overseeing health outcomes at the national level

Ministry of Justice
type: Class
subclass of: Enforcer
comment: Ministry/Department of Justice:This refers to the body that is responsible for overseeing the legal and judicial process of a country at the national level

Mountains
type: Class
subclass of: Civic structure

Municipal Government
type: Class
subclass of: Enforcer

New
type: Class
subclass of: Entry type
comment: The record is the first instance of a policy being made on a given date for the following combination of dimensions: the policy initiator, policy type, policy sub type, geographic target, demographic target.

New task force
type: Class
subclass of: Distribution of competences
subclass of: Enforcer
comment: New task force or entity recieve a certain power

No COVID-19
type: Class
subclass of: direct
comment: No COVID-19 direct health metric. Depends on its frequency (daily, weekly, fortnightly, monthly...) and the type of numerical value it refers to (level, ratio or index, rate, average, growth in the same period of the previous year, growth previous period, cumulative count...)

No conditions
type: Class
subclass of: Allowed
comment: Measures related to permission with no conditions on services, activities...

Non-ICU
type: Class
subclass of: occupancy hospital area installation
comment: Hospitalistion but not in an ICU. Depends on its frequency (daily, weekly, fortnightly, monthly...) and the type of numerical value it refers to (level, ratio or index, rate, average, growth in the same period of the previous year, growth previous period, cumulative count...)

Non essential worker
type: Class
subclass of: Worker
comment: Non essential workers are those who conduct a range of operations and services that are not typically essential to continue critical infrastructure operations.

North america
type: Class
subclass of: Geographical distribution

Nurses
type: Class
subclass of: Health Staff
comment: Accredited professionals with a license to support medical treatment and services but cannot make medical decisions

Oceania
type: Class
subclass of: Geographical distribution

Optician
type: Class
subclass of: Medical

Original
type: Class
subclass of: Correct type
comment: The record has been entered as originally coded

Other
type: Class
subclass of: Geographical distribution
subclass of: Political distribution

PCR test
type: Class
subclass of: Tests
comment: PCR test. Depends on its frequency (daily, weekly, fortnightly, monthly...) and the type of numerical value it refers to (level, ratio or index, rate, average, growth in the same period of the previous year, growth previous period, cumulative count...)

Park
type: Class
subclass of: Civic structure
comment: A large public garden or area of land used for recreation

Passenger car registration
type: Class
subclass of: Socio-economic
comment: Passenger car registrations refer to the number of newly (first-time) registered passenger cars (private cars) or vehicles (commercial cars) registered to the authorities. Data are sourced via the European Automobile Manufacturer's Association (ACEA) and measured in number of units. Data are presented here in terms of the growth over previous period. Depends on its frequency (daily, weekly, fortnightly, monthly...) and the type of numerical value it refers to (level, ratio or index, rate, average, growth in the same period of the previous year, growth previous period, cumulative count...)

percentage
type: Class
subclass of: unit
subclass of: Restriction
  on property: percent
  all values from: percentage
comment: Refers to a percentage as a unit of a metric

Permits issued for dwellings
type: Class
subclass of: Socio-economic
comment: The aim of the index of residential building permits is to show the future development of construction activity in terms of numbers of units. Depends on its frequency (daily, weekly, fortnightly, monthly...) and the type of numerical value it refers to (level, ratio or index, rate, average, growth in the same period of the previous year, growth previous period, cumulative count...)

Personal Protective Equipment
type: Class
subclass of: Materials
comment: Specialized clothing or equipment worn for protection against health hazards. Personal Protective Equipment may include MASKS; RESPIRATORY PROTECTIVE DEVICES; HEAD PROTECTIVE DEVICES; EYE PROTECTIVE DEVICES; EAR PROTECTIVE DEVICES; PROTECTIVE CLOTHING; and protective footwear. [MESH]

Personal grooming
type: Class
subclass of: Business
comment: These refer to establishments that provide ser vices for personal care or hygiene, e.g. hair or nail salons

Pharmacies
type: Class
subclass of: Medical
comment: Facilities for the preparation and dispensing of drugs. [MESH]

Police
type: Class
subclass of: Enforcer
comment: An organization empowered by the state to enforce the law at any level of government (e.g. national, provincial, etc.)

Policy decision
type: Class
subclass of: Restriction
  on property: referred to
  some values from: Impact metrics
subclass of: Restriction
  on property: acts in
  all values from: Type of place
subclass of: Restriction
  on property: conditions
  all values from: Geographic target
subclass of: Restriction
  on property: controls
  all values from: Services
subclass of: Restriction
  on property: influences
  all values from: Demographic target
subclass of: Restriction
  on property: is made by
  all values from: Enforcer
subclass of: Restriction
  on property: is updated
  max qualified cardinality: 1
  on class: Policy decision
subclass of: Restriction
  on property: update
  max qualified cardinality: 1
  on class: Policy decision
subclass of: Restriction
  on property: domestic policy
  some values from: boolean
subclass of: Restriction
  on property: description
  all values from: string
subclass of: Restriction
  on property: init country level
  all values from: geographic level
subclass of: Restriction
  on property: target direction
  all values from: target direction
subclass of: Restriction
  on property: link
  min qualified cardinality: 1
  on data range: string
subclass of: Restriction
  on property: record id
  qualified cardinality: 1
  on data range: string
subclass of: Restriction
  on property: date announced
  max qualified cardinality: 1
  on data range: dateTime
subclass of: Restriction
  on property: date end
  max qualified cardinality: 1
  on data range: dateTime
subclass of: Restriction
  on property: date start
  max qualified cardinality: 1
  on data range: dateTime
subclass of: Restriction
  on property: date updated
  max qualified cardinality: 1
  on data range: dateTime
subclass of: Restriction
  on property: policy id
  max qualified cardinality: 1
  on data range: int
subclass of: Restriction
  on property: institution status
  max qualified cardinality: 1
  on data range: string
comment: Define the government response project policies, representing national and sub-national policy event data

Political
type: Class
subclass of: Impact metrics
comment: Defines metics in relation to policy

Political distribution
type: Class
subclass of: Geographic target

Population special conditions
type: Class
subclass of: Demographic target
comment: This variable captures information more generally about who the target of a policy is, codes the population who have with spacial conditions

Postponement
type: Class
subclass of: Type restriction
comment: Postponement of events or in relation to services or venues

Preschool
type: Class
subclass of: Education center
comment: Takes a value of 1 if no restrictions are placed on preschool or childcare facilities (generally for children ages 5 and below), a value of 2 if these facilities are partly open, and a value of 3 if they are completely closed. [Coronanet Codebook] An educational institution for children that precedes kindergarten. [NCIThesaurus]

Price-purchasing power indicators
type: Class
subclass of: Socio-economic

Primary Schools
type: Class
subclass of: Education center
comment: Takes a value of 1 if no restrictions are placed on primary schools (generally for children ages 10 and below), a value of 2 if these facilities are partly open, and a value of 3 if they are completely closed. [Coronanet Codebook]

Printed materials
type: Class
subclass of: Engagement
comment: Policies of Public Awareness Measures related to engagement through any type of printed material

Prison
type: Class
subclass of: Civic structure
comment: A building in which people are legally held as a punishment for a crime they have committed or while awaiting trial

Processing documents
type: Class
subclass of: Services
comment: It refers to the procedure involved in the conversion of physical documents and the related forms into digitized form with the data extraction, thereby arranging it to a relevant structured format. Documents are of various formats, file types, and include value-specific information, for example, permissions, certificates, etc.

Production
type: Class
subclass of: Services
comment: Production service

Prohibition
type: Class
subclass of: Type restriction
comment: Policy measures related to the prohibition of certain things

Proof vaccination
type: Class
subclass of: External border
comment: Documentation which demonstrates that has a traveler has received a COVID-19 vaccination

Public Awareness Measures
type: Class
subclass of: Containment
comment: Efforts to disseminate or gather reliable information about COVID-19, including ways to prevent or mitigate the health effects of COVID-19. [CORONANET]

Publishing
type: Class
subclass of: Business
comment: "The business or profession of the commercial production and issuance of literature" (Webster's 3d). It includes the publisher, publication processes, editing and editors. Production may be by conventional printing methods or by electronic publishing. [MESH]

Purchase
type: Class
subclass of: Services
comment: The action of obtaining something by payment. [NCIT - Purchase]

Quarantine
type: Class
subclass of: Restriction
comment: Targets of the policy are obliged to isolate themselves for at least 14 days because there is reason to suspect a person is infected with COVID-19

Rail
type: Class
subclass of: Type of vehicle

Re-establishment
type: Class
subclass of: Type restriction
comment: Restoration to the initial state after an average previously taken by the covid19

Recommended
type: Class
subclass of: Compliance
comment: The prescribed policy is recommended by the initiating body but compliance is voluntary

Reduction
type: Class
subclass of: Type restriction
comment: Measures related to the reduction of services, activities or people allowed in a place

Refugee seekers
type: Class
subclass of: Population special conditions
comment: Population special conditions:Refugee seekers

Regulation
type: Class
subclass of: Containment
comment: Government policy which regulates some variable like private or commercial activity, some aspect educational...

Relaxing
type: Class
subclass of: Update
comment: A policy relaxes in terms of its conditions, coverage, or compliance, or duration

Relevance
type: Class
subclass of: Type of place
comment: Defines the types of place (businesses, facilities, civic structures...) as essential and non-essential

Research Facilities
type: Class
subclass of: Civic structure
comment: Takes a value of 1 if there is a health testing policy which affects health research facilities. [Coronanet codebook]

Residence
type: Class
subclass of: Accomodation places

Resources research development
type: Class
subclass of: Services
comment: Refers to the resources and efforts that a company or center devotes to the innovation, and improvement of its products and processes.

Restaurant
type: Class
subclass of: Business
comment: This refers to establishments that provide prepared food and drink services to patrons

Restriction
type: Class
subclass of: Containment
comment: Policies related to restrictions

Retail businesses
type: Class
subclass of: Business
comment: This refers to shops such as clothing stores, specialty goods, flower shops, etc.

Retail trade
type: Class
subclass of: Commercial transactions
comment: The Retail Trade Volume Index is a business indicator that measures monthly changes in deflated retail trade turnover at both the European Union (EU) and euro area level, and for individual EU Member States (as well as some candidate and EFTA countries). Depends on its frequency (daily, weekly, fortnightly, monthly...) and the type of numerical value it refers to (level, ratio or index, rate, average, growth in the same period of the previous year, growth previous period, cumulative count...)

Room
type: Class
subclass of: Accomodation places

Schengen area
type: Class
subclass of: Political distribution

Schengen area and UK
type: Class
subclass of: Political distribution

Secondary Schools
type: Class
subclass of: Education center
comment: Takes a value of 1 if no restrictions are placed on secondary schools (generally for children ages 10 to 18), a value of 2 if these facilities are partly open, and a value of 3 if they are completely closed. [Coronanet Codebook]

Services
type: Class
subclass of: Restriction
  on property: are related to
  all values from: Impact metrics
subclass of: Restriction
  on property: is controlled by a
  all values from: Policy decision
subclass of: Restriction
  on property: is given to a
  all values from: Demographic target
subclass of: Restriction
  on property: offered by a
  all values from: Type of place
subclass of: Restriction
  on property: number of
  all values from: int
comment: Services as someone or something that is intended to provide help to those providing assistance to others

Setting the amount
type: Class
subclass of: Economic measures

Share prices
type: Class
subclass of: Price-purchasing power indicators
comment: Share price indices are calculated from the prices of common shares of companies traded on national or foreign stock exchanges. They are usually determined by the stock exchange, using the closing daily values for the monthly data, and normally expressed as simple arithmetic averages of the daily data. A share price index measures how the value of the stocks in the index is changing, a share return index tells the investor what their “return” is, meaning how much money they would make as a result of investing in that basket of shares. A price index measures changes in the market capitalisation of the basket of shares in the index whereas a return index adds on to the price index the value of dividend payments, assuming they are re-invested in the same stocks. Occasionally agencies such as central banks will compile share indices. Depends on its frequency (daily, weekly, fortnightly, monthly...) and the type of numerical value it refers to (level, ratio or index, rate, average, growth in the same period of the previous year, growth previous period, cumulative count...)

Shipping
type: Class
subclass of: Distribution
comment: The act or business of transporting goods. [NCIT]

Shopping centers
type: Class
subclass of: Business
comment: This refers to commercial centers in which retail busi nesses are available in a centralized location

Smart phones
type: Class
subclass of: contact tracking
comment: Policy measures related to health monitoring through contact teams, smart phones

Social
type: Class
subclass of: Policy decision
comment: Social policy decisions

Social distancing
type: Class
subclass of: Health measures
subclass of: Restriction
  on property: acts in
  all values from: Type of place
subclass of: Restriction
  on property: number of
  all values from: int
comment: Government policies that limit physical contact between individuals. This variable can provide additional detail about the type of social distancing and the place where rules being applied

Socio-economic
type: Class
subclass of: Impact metrics
comment: Defines metics in relation to socio-economic factors

Sport centres
type: Class
subclass of: Commercial businesses
comment: Sport centers

Staff
type: Class
subclass of: Health Resources

Storage
type: Class
subclass of: Distribution
comment: A service offering that describes a service in which the consumer provides some material or data as input which a service provider stores and returns as output. [ERO]

Strengthening
type: Class
subclass of: Update
comment: A policy strengthens in terms of its conditions, coverage, or compliance, or duration

Student
type: Class
subclass of: Task
comment: A person who is enrolled in an educational institution. [National Cancer Institute Thesaurus] A student is an individual who is attends an educational institution. Individuals enrolled in a school or formal educational program.

Subway
type: Class
subclass of: Rail
comment: Cars as a means of transportation
comment: Subway as a means of transportation

Supermarkets
type: Class
subclass of: Business
comment: These refer to establishments that sell food (e.g. fresh produce, meat, baked goods)

Support for transportation
type: Class
subclass of: Business
comment: Bussiness related to Support for transportation It refers to businesses whose main activity is related to the development, administration, maintenance, and operation of the transportation system and with the supply of transportation services.

Teacher
type: Class
subclass of: tertiary sector
comment: Members of staff responsible for TEACHING students in a school from pre-kindergarten through twelfth grade. [Medical Subject Headings ontology - School Teachers] One who instructs or educates others. [NCI Thesaurus]

Telecommunications
type: Class
subclass of: Business
comment: Business related to telecommunications It refers to businesses whose main activity is focused on the development, ownership or operation of a mobile telephony system and other telephony, telecommunication, information or internet services and any other services ancillary, related or complementary to any such system or such other services.

Telemedicine
type: Class
subclass of: Health Resources

Teleworking
type: Class
subclass of: Work
comment: Policies related to teleworking

Temporary Medical Units
type: Class
subclass of: General health
comment: Physical structures that have been temporarily erected for the explicit purpose of treating COVID-19 patients

Temporary quarantine facility
type: Class
subclass of: General health
comment: Physical structures that have been temporarily erected for the purpose of accommodating people under quarantine

Terrestrial
type: Class
subclass of: Type of vehicle

Test Kits
type: Class
subclass of: Materials
comment: Commercially prepared reagent sets, with accessory devices, containing all of the major components and literature necessary to perform one or more designated diagnostic tests or procedures. They may be for laboratory or personal use. [MESH - Reagent Kits, Diagnostic]

Toilets
type: Class
subclass of: Civic structure
comment: Type of place: toilets

Total border cross ban
type: Class
subclass of: External border
comment: Measures that categorically prohibit the entry or exit from a geographical region.

Traditional media
type: Class
subclass of: Engagement
comment: Policies of Public Awareness Measures related to engagement through traditional media

Trains
type: Class
subclass of: Rail
comment: Train as a means of transportation

Trams
type: Class
subclass of: Rail
comment: Trams as a means of transportation

Transport station
type: Class
subclass of: Civic structure
subclass of: Restriction
  on property: of
  all values from: Type of vehicle
comment: Transport station for any type of vehicle

Travel History Form
type: Class
subclass of: External border
comment: A form in which travelers document which countries they’ve recently visited

Type of place
type: Class
subclass of: Restriction
  on property: have workers
  all values from: Demographic target
subclass of: Restriction
  on property: is subject to
  all values from: Policy decision
subclass of: Restriction
  on property: provides
  all values from: Services
comment: Entities that have a somewhat fixed, physical extension

Type of property
type: Class
subclass of: Type of place

Unemployment
type: Class
subclass of: Labour market
comment: The unemployed are people of working age who are without work, are available for work, and have taken specific steps to find work. The uniform application of this definition results in estimates of unemployment rates that are more internationally comparable than estimates based on national definitions of unemployment. This indicator is measured in numbers of unemployed people as a percentage of the labour force and it is seasonally adjusted. The labour force is defined as the total number of unemployed people plus those in employment. Data are based on labour force surveys (LFS). For European Union countries where monthly LFS information is not available, the monthly unemployed figures are estimated by Eurostat. Depends on its frequency (daily, weekly, fortnightly, monthly...) and the type of numerical value it refers to (level, ratio or index, rate, average, growth in the same period of the previous year, growth previous period, cumulative count...)

Unit labour cost
type: Class
subclass of: Price-purchasing power indicators
comment: Unit labour costs are often viewed as a broad measure of (international) price competitiveness. They are defined as the average cost of labour per unit of output produced. They can be expressed as the ratio of total labour compensation per hour worked to output per hour worked (labour productivity). This indicator is measured in percentage changes and indices. Depends on its frequency (daily, weekly, fortnightly, monthly...) and the type of numerical value it refers to (level, ratio or index, rate, average, growth in the same period of the previous year, growth previous period, cumulative count...)

units
type: Class
subclass of: unit
comment: Units as unit of a metric

Update
type: Class
subclass of: Entry type
comment: The record is an update to a new entry insofar as some dimension of the record changes other than the following dimensions: the policy initiator, policy type, policy sub type, geographic target, demographic target.

Vaccines
type: Class
subclass of: Materials
subclass of: Restriction
  on property: vaccine type
  some values from: vaccine type
comment: Suspensions of killed or attenuated microorganisms (bacteria, viruses, fungi, protozoa), antigenic proteins, synthetic constructs, or other bio-molecular derivatives, administered for the prevention, amelioration, or treatment of infectious and other diseases. [MESH]

Vaccines type
type: Class
subclass of: Vaccines
comment: Type of vaccine

Ventilators
type: Class
subclass of: Materials
comment: Mechanical devices used to produce or assist pulmonary ventilation. [MESH]

Visa extensions
type: Class
subclass of: External border
comment: Measures that make the process for obtaining a visa to visit/reside in a country easier

Visa restrictions
type: Class
subclass of: External border
comment: Measures that make the process for obtaining a visa to visit/reside in a country more difficult

Volunteer
type: Class
subclass of: Task
comment: A person who works without being paid

Warehouse
type: Class
subclass of: Business
comment: A warehouse is a building which is used for the storage of goods. [ENVO]

Water Supply, Sewerage, Waste Management, Remediation
type: Class
subclass of: Business
comment: Bussiness related to Water Supply, Sewerage, Waste Management, remediation

Wearable technology
type: Class
subclass of: contact tracking
comment: Policy measures related to health monitoring through contact teams, human teams wearable technology

Wearing mask
type: Class
subclass of: Health measures
comment: Measurement of mask wearing

Welfare
type: Class
subclass of: Social

Work
type: Class
subclass of: Containment
comment: Policies related to work

Worker
type: Class
subclass of: Task
comment: A person who does a specified type of work

Working hours
type: Class
subclass of: Work
comment: Decision policies related to working hours These policies refer to aspects to be taken into account during the working hours, such as, sanitary measures that must be taken, number of working hours, work modality (face-to-face or telecommuting), etc.

Worship
type: Class
subclass of: Civic structure
comment: An act of religious devotion, usually directed towards a deity. [GSSO]

Youth
type: Class
subclass of: Age
comment: Demographic target who by age belong to the category of youth The time of life between childhood and maturity. This period overlaps with adolescence. [NCIT]

active
type: Class
subclass of: cases
comment: The number of active cases. Depends on its frequency (daily, weekly, fortnightly, monthly...) and the type of numerical value it refers to (level, ratio or index, rate, average, growth in the same period of the previous year, growth previous period, cumulative count...)

admission
type: Class
subclass of: hospital processes
comment: Inpatient admission to a hospital. Depends on its frequency (daily, weekly, fortnightly, monthly...) and the type of numerical value it refers to (level, ratio or index, rate, average, growth in the same period of the previous year, growth previous period, cumulative count...)

Age
type: Class
subclass of: Demographic target
subclass of: Restriction
  on property: maximum
  all values from: int
subclass of: Restriction
  on property: minimum
  all values from: int
comment: Age of the demographic target person(s).

antigenic
type: Class
subclass of: Vaccines type
comment: Vaccines contain weakened or inactive parts of a particular organism (antigen) that triggers an immune response within the body.

asian
type: Class
subclass of: Race
comment: A person having origins in any of the original peoples of the Far East, Southeast Asia, or the Indian subcontinent including, for example, Cambodia, China, India, Japan, Korea, Malaysia, Pakistan, the Philippine Islands, Thailand, and Vietnam.

average
type: Class
subclass of: numeric value type
comment: Calculation of the average of a metric

black american
type: Class
subclass of: Race
comment: Black or African American. A person having origins in any of the black racial groups of Africa. Terms such as "Haitian" or "Negro" can be used in addition to "Black or African American."

contact tracking
type: Class
subclass of: Health Monitoring
comment: Policy measures related to health monitoring through contact tracking

corruption perceptions index
type: Class
subclass of: country policy activity score
comment: (most recent year available from Niehaus dataset) Corruption perceptions index ti cpi TI en coronanet

country policy activity score
type: Class
subclass of: Opinion
comment: Estimate diferent values of the country policy activity score

cumulative
type: Class
subclass of: numeric value type
subclass of: Restriction
  on property: number of
  qualified cardinality: 1
  on data range: int
comment: Calculates the cumulative amount of a variable between certain dates

currency
type: Class
subclass of: unit
subclass of: Restriction
  on property: currency from
  some values from: Geographic target
comment: Country-specific currency

custom
type: Class
subclass of: frequency
comment: Customized time period (start and end date)

daily
type: Class
subclass of: frequency
subclass of: Restriction
  on property: number of
  qualified cardinality: 1
  on data range: int
comment: Denotes a daily frequency variable

data specification
type: Class
subclass of: Impact metrics
comment: type of data metrics about their numerical value (index, rate, cumulative, percentage...) and frequency (daiy, weekly, fortnight)

debt cancellation
type: Class
subclass of: Economic measures
comment: A debt cancellation contract (DCC) is a contractual arrangement modifying loan terms. Under the DCC, a bank agrees to cancel all or part of a customer’s obligation to repay a loan or credit. These contracts become effective upon the occurrence of a specified event as written into the contract, and most people connect them to credit card debts.

difference
type: Class
subclass of: numeric value type
subclass of: Restriction
  on property: number of
  qualified cardinality: 1
  on data range: int
comment: Difference between dates to mediate a metric between these days

direct
type: Class
subclass of: Health

disappearances index
type: Class
subclass of: Socio-economic
comment: (most recent year available from Niehaus dataset) 3 category, ordered variable for disappearances index

discharge
type: Class
subclass of: hospital processes
comment: Discharge from hospital. Depends on its frequency (daily, weekly, fortnightly, monthly...) and the type of numerical value it refers to (level, ratio or index, rate, average, growth in the same period of the previous year, growth previous period, cumulative count...)

electoral democracy index
type: Class
subclass of: Political
comment: v2x_polyarchy_VDEM (most recent year available from Niehaus dataset) Electoral democracy index

emmigrant stock
type: Class
subclass of: Socio-economic
comment: Total emmigrant stock from

fortnightly
type: Class
subclass of: frequency
comment: Denotes a fortnightly frequency variable

frequency
type: Class
subclass of: data specification
subclass of: Restriction
  on property: number of
  qualified cardinality: 1
  on data range: int
comment: Define the frequency of a data and has a property for specifify the number of days, weeks, fortnights or months of this frequency

growing - harvesting of organic commodities
type: Class
subclass of: Business
comment: The branch of manufacture and trade based on the growing and/or harvesting of organic commodities. This includes all livestock and livestock products, food and other agricultural products, forestry and fishery products, and all associated services.

high
type: Class
subclass of: country policy activity score
comment: The high (95% posterior density) estimate of the country policy activity score (0-100) index high est

hospital processes
type: Class
subclass of: Hospitalization data
comment: Specific hospital process(admissions, discharges or transfers). Depends on its frequency (daily, weekly, fortnightly, monthly...) and the type of numerical value it refers to (level, ratio or index, rate, average, growth in the same period of the previous year, growth previous period, cumulative count...)

ifs
type: Class
subclass of: Economic growth indicator
comment: International Financial Statistics

inactivated
type: Class
subclass of: Vaccines type
comment: An inactivated vaccine (or killed vaccine) is a vaccine consisting of virus particles, bacteria, or other pathogens that have been grown in culture and then killed to destroy disease-producing capacity.

index
type: Class
subclass of: unit
comment: Refers to a metric whose unit is an index

index-ratio-level
type: Class
subclass of: numeric value type
subclass of: Restriction
  on property: number of
  qualified cardinality: 1
  on data range: int
comment: Refers to a variable of the type 'index - ratio - level'

index human rights protection
type: Class
subclass of: Political
comment: latentmean_FA (most recent year available from Niehaus dataset) the posterior mean of the latent variable index for human rights protection)

indirect
type: Class
subclass of: Health
comment: Indirect health metrics. Depends on its frequency (daily, weekly, fortnightly, monthly...) and the type of numerical value it refers to (level, ratio or index, rate, average, growth in the same period of the previous year, growth previous period, cumulative count...)

indoor
type: Class
subclass of: Spatial limitation
comment: A location that is happening or arising or located inside some limits, or especially, some surface. [EXO]

travel controls
type: Class
subclass of: Health Monitoring

latino
type: Class
subclass of: Race
comment: A person of Cuban, Mexican, Puerto Rican, South or Central American, or other Spanish culture or origin, regardless of race. The term, "Spanish origin," can be used in addition to "Hispanic or Latino."

layoff bans
type: Class
subclass of: Economic measures

limit social contact
type: Class
subclass of: Health measures
subclass of: Restriction
  on property: number of
  all values from: int
comment: Policies related to limiting social contact to reduce COVID19 transmissions

low
type: Class
subclass of: country policy activity score
comment: The low (95% posterior density) estimate of the country policy activity score (0-100)

mRNA
type: Class
subclass of: Vaccines type
comment: Messenger RNA (mRNA) vaccines teach our cells how to make a protein that triggers an immune response

median
type: Class
subclass of: numeric value type
comment: Refers to the median of a variable

mobility
type: Class
subclass of: Socio-economic

monthly
type: Class
subclass of: frequency
comment: Denotes a monthly frequency variable

native pacific islander
type: Class
subclass of: Race
comment: A person having origins in any of the original peoples of Hawaii, Guam, Samoa, or other Pacific Islands

Non-essential
type: Class
subclass of: Relevance

numeric value type
type: Class
subclass of: data specification

occupancy hospital area installation
type: Class
subclass of: Hospitalization data
comment: Overall occupancy in all the hospital area installation (hospitalization ICU and non-ICU)

Opinion
type: Class
subclass of: Socio-economic

Origin
type: Class
subclass of: Demographic target
comment: This variable codes the people or materials who are the target of a particular policy depending on ‘citizenship’ status or ‘residency’ status

Outdoor
type: Class
subclass of: Spatial limitation
comment: An exogenous location that is happening or arising or located outside. [EXO]

persons
type: Class
subclass of: unit
comment: Refers to the number of people as the unit of measurement of a metric

policy activity score
type: Class
subclass of: Political
comment: index_country_rank The relative rank by each day for each country on the policy activity score

political imprisonment index
type: Class
subclass of: Political
comment: Coronant polpris_FA (most recent year available from Niehaus dataset) 3 category, ordered variable for political imprisonment index

press Freedom
type: Class
subclass of: Opinion

primary sector
type: Class
subclass of: Profession
comment: People working in the primary sector

private
type: Class
subclass of: Type of property
comment: That distinct portion of the institutional, industrial, or economic structure of a country that is controlled or owned by non-governmental, private interests. [MESH - Private Sector]

Profession
type: Class
subclass of: Demographic target
subclass of: Restriction
  on property: name
  all values from: string
comment: This variable codes the people or materials who are the target of a particular policy depending on their profession

public
type: Class
subclass of: Type of property
comment: A public place is a location to which all of the public has access and is not a place exclusively used for a private gathering or any other personal purposes.

quarterly
type: Class
subclass of: frequency
comment: Denotes a quarterly frequency variable

Race
type: Class
subclass of: Demographic target
comment: race of the demographic target

rate
type: Class
subclass of: numeric value type
subclass of: Restriction
  on property: number of
  qualified cardinality: 1
  on data range: int
comment: Refers to the rate of a metric

recombinant
type: Class
subclass of: Vaccines type
comment: Recombinant vaccines are made using bacterial or yeast cells to manufacture the vaccine

recovered
type: Class
subclass of: cases
comment: The number of recovered cases. Depends on its frequency (daily, weekly, fortnightly, monthly...) and the type of numerical value it refers to (level, ratio or index, rate, average, growth in the same period of the previous year, growth previous period, cumulative count...)

Score reporters with borders
type: Class
subclass of: press Freedom
comment: Most recent year available from Niehaus dataset, Reporters with Borders Press Freedom Score

reporters without Borders Ranking
type: Class
subclass of: press Freedom
comment: 'Coronanet [description]: (most recent year available from Niehaus dataset) Reporters without Borders Press Freedom Annual Ranking''

secundaty sector
type: Class
subclass of: Profession
comment: People working in the secundary sector

Sex
type: Class
subclass of: Demographic target
comment: The categories into which humans and most other living things are divided on the basis of their reproductive functions

Spatial limitation
type: Class
subclass of: Type of place

subsides
type: Class
subclass of: Economic measures

syringes
type: Class
subclass of: Materials
comment: Instruments used for injecting or withdrawing fluids. [MESH]

Task
type: Class
subclass of: Demographic target
comment: This variable codes the people or materials who are the target of a particular policy depending on their task

tertiary sector
type: Class
subclass of: Profession
comment: People working in the terciaty sector

Tests
type: Class
subclass of: COVID-19
comment: Health testing of entire population under the government's jurisdiction

transfer
type: Class
subclass of: hospital processes
comment: Transfer from one hospital to another. Depends on its frequency (daily, weekly, fortnightly, monthly...) and the type of numerical value it refers to (level, ratio or index, rate, average, growth in the same period of the previous year, growth previous period, cumulative count...)

transparency Index
type: Class
subclass of: Political
comment: Coonanet transparencyindex_HR (most recent year available from Niehaus dataset) Transparency Index

Type of vehicle
type: Class
subclass of: Type of place
subclass of: Restriction
  on property: is in a
  all values from: Transport station
comment: A vehicle is a device that is designed or used to transport people or cargo over land, water, air, or through space. Examples of vehicle types are: bicycles, cars, motorcycles, trains, ships, boats, and aircraft. Vehicles that do not travel on land often are called craft, such as watercraft, sailcraft, aircraft, hovercraft, and spacecraft. [SCHEMA, HUPSON]

Type restriction
type: Class
subclass of: Containment
comment: This variable covers the different types of restriction policies (both closure and tighter restrictions as well as the opposite of opening and re-establishment).

viral vector
type: Class
subclass of: Vaccines type
comment: A viral vector vaccine is a vaccine that uses a viral vector to introduce genetic material encoding a desired antigen into the cells of the subject receiving the vaccine

weekly
type: Class
subclass of: frequency
comment: Denotes a weekly frequency variable

white
type: Class
subclass of: Race
comment: A person having origins in any of the original peoples of Europe, the Middle East, or North Africa

year over year
type: Class
subclass of: numeric value type
comment: It is used to compare financial results with those of the same period in the previous year

yearly
type: Class
subclass of: frequency
comment: Denotes a yearly frequency variable